{"text_format":"1","workbook":"xlsx","n_sheets":13,"sheets":["SelectionSheet","IncExp","IncExpYearEnd","BalanceSheet","SwimShopYearEnd","CashCert","Assets","Pool Hire Instructions","PoolHire(Apr - Aug)","PoolHire(Sep - Mar)","Module1","Module2","Module3"],"not_rendered":{"charts":0,"images":0,"macros":1,"external_links":0,"defined_names":11,"comments":0,"pivot_tables":0},"unopened":[{"sheet":"Module1","index":10,"reason":"part_missing"},{"sheet":"Module2","index":11,"reason":"part_missing"},{"sheet":"Module3","index":12,"reason":"part_missing"}],"bounds":{"document_bytes":16777216,"sheet_cells":100000,"rows_first":2000,"rows_last":500,"rows_between":2000,"halvings":0,"cell_chars":16384,"cell_head_chars":4096},"cells_cut":0,"cells_raw":0,"read":"whole","date_system":"1900"}

{"sheet":"SelectionSheet","index":0,"n_rows":0,"n_cols":0,"rows_kept":0,"cut":false,"hidden":true,"merged":[]}

{"sheet":"IncExp","index":1,"n_rows":63,"n_cols":247,"rows_kept":63,"cut":false,"hidden":true,"merged":[]}
["STRETFORD AMATEUR SWIMMING CLUB"]
[]
["INCOME AND EXPENDITURE ACCOUNT"]
[]
[null,"2021-10-31",null,null,null,null,null,"2020-10-31","2000-01-01","2002-01-31","2002-02-28"," 31/03/02","2002-04-30","2002-05-31","2002-06-30","2002-08-31","2002-09-30","2002-09-30","2002-10-31","2002-11-30","2002-12-31","2003-01-31","2003-02-28","2003-03-31","2003-04-30","2003-05-31","2003-06-30","2003-07-30","2003-08-31","2003-09-30","2003-10-31","2003-11-30","2003-12-31","2004-01-31","2004-02-29","2004-03-31","2004-04-30","2004-05-31","2004-06-30","2004-07-31","2004-08-31","2004-09-30","2004-10-30","2004-11-30","2004-12-31","2005-01-31","2005-02-28","2005-03-31","2005-04-30","2005-05-31","2005-06-30","2005-07-31","2005-08-31","2005-09-30","2005-10-31","2005-11-30","2005-12-31","2006-01-31","2006-02-28","2006-03-31","2006-04-30","2006-05-31","2006-06-30","2006-07-31","2006-08-31","2006-09-30","2006-10-31","2006-11-30","2006-12-31","2007-01-31","2007-02-28","2007-03-31","2007-04-30","2007-05-31","2007-06-30","2007-07-31","2007-08-31","2007-09-30","2007-10-31","2007-11-30","2007-12-31","2008-01-31","2008-02-29","2008-03-31","2008-04-30","2008-05-31","2008-06-30","2008-07-31","2008-08-31","2008-09-30","2008-10-31","2008-11-30","2008-12-31","2009-01-31","2009-02-28","2009-03-31","2009-04-30","2009-05-31","2009-06-30","2009-07-31","2009-08-31","2009-09-30","2009-10-31","2009-11-30","2009-12-31","2010-01-31","2010-02-28","2010-03-31","2010-04-30","2010-05-31","2010-06-30","2010-07-31","2010-08-31","2010-09-30","2010-10-31","2010-11-30","2010-12-31","2011-01-31","2011-02-28","2011-03-31","2011-04-30","2011-05-31","2011-06-30","2011-07-31","2011-08-31","2011-09-30","2011-10-31","2011-11-30","2011-12-31","2012-01-31","2012-02-29","2012-03-31","2012-04-30","2012-05-31","2012-06-30","2012-07-31","2012-08-31","2012-09-30","2012-10-31","2012-11-30","2012-12-31","2013-01-31","2013-02-28","2013-03-31","2013-04-30","2013-05-31","2013-06-30","2013-07-31","2013-08-31","2013-09-30","2013-10-31","2013-11-30","2013-12-31","2014-01-31","2014-02-28","2014-03-31","2014-04-30","2014-05-31","2014-06-30","2014-07-31","2014-08-31","2014-09-30","2014-10-31","2014-11-30","2014-12-31","2015-01-31","2015-02-28","2015-03-31","2015-04-30","2015-05-31","2015-06-30","2015-07-31","2015-08-31","2015-09-30","2015-10-31","2015-11-30","2015-12-31","2016-01-31","2016-02-29","2016-03-31","2016-04-30","2016-05-31","2016-06-30","2016-07-31","2016-08-31","2016-09-30","2016-10-31","2016-11-30","2016-12-31","2017-01-31","2017-02-28","2017-03-31","2017-04-30","2017-05-31","2017-06-30","2017-07-31","2017-08-31","2017-09-30","2017-10-31","2017-11-30","2017-12-31","2018-01-31","2018-02-28","2018-03-31","2018-04-30","2018-05-31","2018-06-30","2018-07-31","2018-08-31","2018-09-30","2018-10-31","2018-11-30","2018-12-31","2019-01-31","2019-02-28","2019-03-31","2019-04-30","2019-05-31","2019-06-30","2019-07-31","2019-08-31","2019-09-30","2019-10-31","2019-11-30","2019-12-31","2020-01-31","2020-02-29","2020-03-31","2020-04-30","2020-05-31","2020-06-30","2020-07-31","2020-08-31","2020-09-30","2020-10-31","2020-11-30","2020-12-31","2021-01-31","2021-02-28","2021-03-31","2021-04-30","2021-05-31","2021-06-30","2021-07-31","2021-08-31","2021-09-30","2021-10-31"]
[null,null,null,null,"£","£","£","£","Pounds","£","£","£","£","£","£","£","£","£","£","£","£","£","£","£","£","£","£","£","£","£","£","£","£","£","£","£","£","£","£","£","£","£","£","£","£","£","£","£","£","£","£","£","£","£","£","£","£","£","£","£","£","£","£","£","£","£","£","£","£","£","£","£","£","£","£","£","£","£","£","£","£","£","£","£","£","£","£","£","£","£","£","£","£","£","£","£","£","£","£","£","£","£","£","£","£","£","£","£","£","£","£","£","£","£","£","£","£","£","£","£","£","£","£","£","£","£","£","£","£","£","£","£","£","£","£","£","£","£","£","£","£","£","£","£","£","£","£","£","£","£","£","£","£","£","£","£","£","£","£","£","£","£","£","£","£","£","£","£","£","£","£","£","£","£","£","£","£","£","£","£","£","£","£","£","£","£","£","£","£","£","£","£","£","£","£","£","£","£","£","£","£","£","£","£","£","£","£","£","£","£","£","£","£","£","£","£","£","£","£","£","£","£","£","£","£","£","£","£","£","£","£","£","£","£","£","£","£","£","£","£","£","£","£","£","£","£","£"]
[null,null,null,null," "]
[null,"BALANCE BROUGHT FORWARD:",null,null,"2020-11-01",null,53118.39,51126.609999999993,null,17371.68,17371.68,17371.68,17371.68,17371.68,17371.68,17371.68,17371.68,17371.68,17371.68,17371.68,17371.68,13668.76,13668.76,13668.76,13668.76,13668.76,13668.76,13668.76,13668.76,13668.76,13668.76,13668.76,13668.76,16017.52,16017.52,16017.52,16017.52,16017.52,16017.52,16017.52,16017.52,16017.52,16017.52,16017.52,16017.52,15075.87,15075.87,15075.87,15075.87,15075.87,15075.87,15075.87,15075.87,15075.87,15075.87,15075.87,15075.87,10964.87,10964.87,10964.87,10964.87,10964.87,10964.87,10964.87,10964.87,10964.87,10964.87,10964.87,10964.87,28187.72,28187.72,28187.72,28187.72,28187.72,28187.72,28187.72,28187.72,28187.72,28187.72,28187.72,28187.72,36163.33,36163.33,36163.33,36163.33,36163.33,36163.33,36163.33,36163.33,36163.33,36163.33,36163.33,36163.33,39129.5,39129.5,39129.5,39129.5,39129.5,39129.5,39129.5,39129.5,39129.5,39129.5,39129.5,39129.5,36819.69,36819.69,36819.69,36819.69,36819.69,36819.69,36819.69,36819.69,36819.69,36819.69,36819.69,36819.69,32113.23,32113.23,32113.23,32113.23,32113.23,32113.23,32113.23,32113.23,32113.23,32113.23,32113.23,32113.23,28856.799999999999,28856.799999999999,28856.799999999999,28856.799999999999,28856.799999999999,28856.799999999999,28856.799999999999,28856.799999999999,28856.799999999999,28856.799999999999,28856.799999999999,28856.799999999999,29829.03,29829.03,29829.03,29829.03,29829.03,29829.03,29829.03,29829.03,29829.03,29829.03,35028.620000000003,35028.620000000003,35028.620000000003,35028.620000000003,35028.620000000003,35028.620000000003,35028.620000000003,35028.620000000003,35028.620000000003,35028.620000000003,35028.620000000003,35028.620000000003,37231.780000000006,37231.780000000006,37231.780000000006,37231.780000000006,37231.780000000006,37231.780000000006,37231.780000000006,37231.780000000006,37231.780000000006,37231.780000000006,37231.780000000006,37231.780000000006,32331.47,32331.47,32331.47,32331.47,32331.47,32331.47,32331.47,32331.47,32331.47,32331.47,32331.47,32331.47,35157.950000000004,35157.950000000004,35157.950000000004,35157.950000000004,35157.950000000004,35157.950000000004,35157.950000000004,35157.950000000004,35157.950000000004,35157.950000000004,35157.950000000004,35157.950000000004,47005.85,47005.85,47005.85,47005.85,47005.85,47005.85,47005.85,47005.85,47005.85,47005.85,47005.85,47005.85,47950.44,47950.44,47950.44,47950.44,47950.44,47950.44,47950.44,47950.44,47950.44,47950.44,47950.44,47950.44,51126.609999999993,51126.609999999993,51126.609999999993,51126.609999999993,51126.609999999993,51126.609999999993,51126.609999999993,51126.609999999993,51126.609999999993,51126.609999999993,51126.609999999993,51126.609999999993,53118.39,53118.39,53118.39,53118.39,53118.39,53118.39,53118.39,53118.39,53118.39,53118.39,53118.39,53118.39]
[]
[null,null,null,null,"INCOME","EXPEND"]
{"$rows_left_out":54}
{"sheet":"IncExpYearEnd","index":2,"n_rows":48,"n_cols":17,"rows_kept":48,"cut":false,"hidden":false,"merged":[]}
[]
[null,null,null,null,null,null,"STRETFORD AMATEUR SWIMMING CLUB"]
[null,null,"Income/Expenditure Account Nov 20/Oct 21"]
[null,null,"2020/21",null,"2019/20",null,null,"2020/21",null,"2019/20",null,"Net Surplus",null,"Net Surplus"]
[null,"Expenditure","£",null,"£",null,"Income ","£",null,"£",null,"£",null,"£"]
[null,"Pool Hire",{"$f":"IncExp!F12","v":0},null,0,null,"Pool Hire",null,null,null,null,{"$f":"SUM(H6-C6)","v":0},null,{"$f":"SUM(J6-E6)","v":0}]
[null,"Swimming",{"$f":"SUMIF(IncExp!$B$12:$B$50,IncExpYearEnd!B7,IncExp!$F$12:$F$50)","v":28094.7},null,18381.2,null,"Swimming",{"$f":"SUMIF(IncExp!$B$12:$B$50,IncExpYearEnd!G7,IncExp!$E$12:$E$50)","v":31729},null,31732.89,null,{"$f":"SUM(H7-C7)","v":3634.2999999999993},null,13351.689999999999]
[null,"Senior Water Polo",{"$f":"SUMIF(IncExp!$B$12:$B$50,IncExpYearEnd!B8,IncExp!$F$12:$F$50)","v":1957.76},null,1975.5,null,"Senior Water Polo",{"$f":"SUMIF(IncExp!$B$12:$B$50,IncExpYearEnd!G8,IncExp!$E$12:$E$50)","v":2052.1999999999998},null,3135,null,94.439999999999827,null,1159.5]
[null,"Junior Water Polo",{"$f":"SUMIF(IncExp!$B$12:$B$50,IncExpYearEnd!B9,IncExp!$F$12:$F$50)","v":3696},null,3869.25,null,"Junior Water Polo",{"$f":"SUMIF(IncExp!$B$12:$B$50,IncExpYearEnd!G9,IncExp!$E$12:$E$50)","v":5542.85},null,5852.03,null,1846.8500000000004,null,1982.7799999999997]
[null,"Adults",{"$f":"SUMIF(IncExp!$B$12:$B$50,IncExpYearEnd!B10,IncExp!$F$12:$F$50)","v":976.8},null,1035.5,null,"Adults",{"$f":"SUMIF(IncExp!$B$12:$B$50,IncExpYearEnd!G10,IncExp!$E$12:$E$50)","v":1100},null,1055.5,null,123.20000000000005,null,20]
{"$rows_left_out":39}
{"sheet":"BalanceSheet","index":3,"n_rows":31,"n_cols":12,"rows_kept":31,"cut":false,"hidden":false,"merged":[[1,1,1,11]]}
["STRETFORD AMATEUR SWIMMING CLUB"]
[null,"2020/21"]
[]
["Balance Sheet"]
[null,null,null,"2020/21",null,"2019/20",null,null,null,"2020/21",null,"2019/20"]
[null,"Liabilities","£","£",null,"£",null,"Assets",null,"£",null,"£"]
[null,"Balance at 1 Nov",null,{"$f":"L10+L11+L12","v":53224.389999999992},null,51891.609999999993,null,"Bank - Current Account",{"$f":"IncExp!G57","v":8292.48}]
[null,null,null,null,null,null,null,"Bank - Premium Account",{"$f":"IncExp!G58","v":38491.100000000006}]
[null,null,null,null,null,null,null,"Bank - D Francis Fund",{"$f":"IncExp!G59","v":1573.56}]
[null,null,null,null,null,null,null,null,null,{"$f":"SUM(I7:I9)","v":48357.14},null,53118.389999999992]
{"$rows_left_out":22}
{"sheet":"SwimShopYearEnd","index":4,"n_rows":30,"n_cols":5,"rows_kept":30,"cut":false,"hidden":true,"merged":[]}
["Stretford Amateur Swimming Club"]
["Swim Shop Stock at 31 Oct 2021"]
[]
["Item No","Description","Stock ","Value/Ea","Total Value"]
[100,"SASC Silicon Caps",null,4.5,{"$f":"C5*D5","v":0}]
[206,"Jammers 1",null,12.5,0]
[207,"Jammers 2",null,0,0]
[300,"Hoodie Adult",null,20,0]
[301,"Hoodie Junior",null,15.5,0]
[305,"New T Shirt Junior",null,11,0]
{"$rows_left_out":21}
{"sheet":"CashCert","index":5,"n_rows":15,"n_cols":3,"rows_kept":15,"cut":false,"hidden":true,"merged":[]}
["STRETFORD AMATEUR SWIMMING CLUB"]
[]
["CERTIFICATE OF CASH"]
[]
[]
[]
["This is to certify that the Treasurer, Dawn Cole, currently has £115.60  in her "]
["possession"]
[]
[]
{"$rows_left_out":6}
{"sheet":"Assets","index":6,"n_rows":43,"n_cols":28,"rows_kept":43,"cut":false,"hidden":true,"merged":[]}
[null,"Stretford Amateur Swimming Club"]
[]
["Assets","Held By/ Located at","Qty","Today's New Price","Value at 31/12/95","Value at 31/12/96","Value at 31/12/97","Value at 31/12/98","Value at 31/12/99","Value at 31/12/00","Value at 31/12/02","Value at 31/12/03","Value at 31/12/04","Value at 31/12/05","Value at 31/12/06","Value at 31/12/07","Value at 31/12/08","Value at 31/12/09","Value at 31/12/10","Value at 31/12/11","Value at 31/12/12","Value at 31/10/13","Value at 31/10/14","Value at 31/10/15","Value at 31/10/16","Value at 31/10/17","Value at 31/10/18","Value at 31/10/19"]
[]
["Trophies","Winners",null,null,3948.75,4000,4000,4000,4000,4000,4000,4000,4000,4000,4000,4000,4000,4000,4000,4000,4000,4000,4000,4000,4000,4000,4000]
["Typewriters","Scrapped",2,null,24.38,0]
["Word-Processor/Electronic Typewriter","S Foster",1,null,195,140,100,70,50,50,50,50,50,0,0]
["Video Camera and Equipment and Batteries","G Holme",1,null,536.25,400,350,250,150,100,50,30,30,30,30,0,0,0,0,0,0,0,0,0,0,0,0]
["Electronic Scoreboard and Water polo Clock","Stretford L. C.",1,null,1072.5,800,600,500,400,350,250,200,200,150,150,150,150,150,150,150,150,150,150,150,150,150,150]
["35 Second Clock (Set)","Stretford L. C.",1,null,438.75,330,250,200,150,100,50,50,50,40,40,40,40,40,0,0,0,0,0,0,0,0,0]
{"$rows_left_out":34}
{"sheet":"Pool Hire Instructions","index":7,"n_rows":19,"n_cols":3,"rows_kept":19,"cut":false,"hidden":true,"merged":[]}
[null,null,"Instructions for completing the Pool Hire sheets  for Apr - Aug and Sep - Mar"]
[]
[1,"At the top of each heading for each month fill in the yellow field with the month on the formate 01/04/01"]
[]
[2,"The month will fill in automatically for each week in that month"]
[]
[3,"For the days only complete the first row of every month (coloured yellow) starting on the correct day in the week."]
[]
[4,"The rest of the weeks will fill themselves in correctly (except in a leap year), ignore the fact that it may not be a proper day!"]
[]
{"$rows_left_out":10}
{"sheet":"PoolHire(Apr - Aug)","index":8,"n_rows":109,"n_cols":58,"rows_kept":109,"cut":false,"hidden":true,"merged":[]}
["STRETFORD AMATEUR SWIMMING CLUB",null,null,null,null,null,null,null,null,null,"STRETFORD AMATEUR SWIMMING CLUB",null,null,null,null,null,null,null,null,null,"STRETFORD AMATEUR SWIMMING CLUB",null,null,null,null,null,null,null,null,null,"STRETFORD AMATEUR SWIMMING CLUB",null,null,null,null,null,null,null,null,null,"STRETFORD AMATEUR SWIMMING CLUB",null,null,null,null,null,null,null,null,null,"STRETFORD AMATEUR SWIMMING CLUB"]
[null,null,null,null,"POOL HIRE ","2003-04-01",null,null,null,null,null,null,null,null,"POOL HIRE ","2003-05-01",null,null,null,null,null,null,null,null,"POOL HIRE ","2003-06-01",null,null,null,null,null,null,null,null,"POOL HIRE ","2003-07-01",null,null,null,null,null,null,null,null,"POOL HIRE ","2003-08-01",null,null,null,null,"April - August 2001",null,2002,null,2002]
[]
[{"$f":"$F$2","v":"2003-04-01"},"Date",null,1,2,3,4,5,6,"Total",{"$f":"$P$2","v":"2003-05-01"},"Date",null,null,null,1,2,3,4,"Total",{"$f":"Z$2","v":"2003-06-01"},"Date",null,null,null,null,null,null,1,"Total",{"$f":"AJ$2","v":"2003-07-01"},"Date",null,1,2,3,4,5,6,"Total",{"$f":"AT$2","v":"2003-08-01"},"Date",null,null,null,1,2,3,4,"Total"," ","Year",null,null,null,null,null,"Total"]
[null,"Day",null,"Tue","Wed","Thu","Fri","Sat","Sun","Hours",null,"Day",null,null,null,"Thu","Fri","Sat","Sun","Hours",null,"Day",null,null,null,null,null,null,"Sun","Hours",null,"Day",null,"Tue","Wed","Thu","Fri","Sat","Sun","Hours",null,"Day","Mon","Tue","Wed","Thu","Fri","Sat","Sun","Hours",null,"Month","Apr","May","Jun","July","Aug","Hours"]
["Main Pool","Junior Hrs",null,null,null,null,null,null,null,{"$f":"SUM(C6:I6)","v":0},"Main Pool","Junior Hrs",null,null,null,null,null,null,null,{"$f":"SUM(M6:S6)","v":0},"Main Pool","Junior Hrs",null,null,null,null,null,null,null,{"$f":"SUM(W6:AC6)","v":0},"Main Pool","Junior Hrs",null,null,null,null,null,null,null,{"$f":"SUM(AG6:AM6)","v":0},"Main Pool","Junior Hrs",null,null,null,null,null,null,null,{"$f":"SUM(AQ6:AW6)","v":0},"Main Pool","Junior Hrs",{"$f":"SUM(J6+J24+J42+J60+J78+J96)","v":0},{"$f":"SUM(T6+T24+T42+T60+T78+T96)","v":0},{"$f":"SUM(AD6+AD24+AD42+AD60+AD78+AD96)","v":0},{"$f":"SUM(AN6+AN24+AN42+AN60+AN78+AN96)","v":0},{"$f":"SUM(AX6+AX24+AX42+AX60+AX78+AX96)","v":0},{"$f":"SUM(BA6:BE6)","v":0}]
[null,"Time",null,null,null,null,null,null,null,null,null,"Time",null,null,null,null,null,null,null,null,null,"Time",null,null,null,null,null,null,null,null,null,"Time",null,null,null,null,null,null,null,null,null,"Time",null,null,null,null,null,null,null,null,null,"Cost @ £9.25",{"$f":"BA6*9.25","v":0},{"$f":"BB6*9.25","v":0},{"$f":"BC6*9.25","v":0},{"$f":"BD6*9.25","v":0},{"$f":"BE6*9.25","v":0},0]
[null,"Junior Hrs",null,null,null,null,null,1,1,{"$f":"SUM(C8:I8)","v":2},null,"Junior Hrs",null,null,null,null,null,1,1,{"$f":"SUM(M8:S8)","v":2},null,"Junior Hrs",null,null,null,null,null,null,1,{"$f":"SUM(W8:AC8)","v":1},null,"Junior Hrs",null,null,null,null,null,1,1,{"$f":"SUM(AG8:AM8)","v":2},null,"Junior Hrs",null,null,null,null,null,null,null,null,null,"Junior Hrs",{"$f":"SUM(J8+J26+J44+J62+J80+J98)","v":8},{"$f":"SUM(T8+T26+T44+T62+T80+T98)","v":9},{"$f":"SUM(AD8+AD26+AD44+AD62+AD80+AD98)","v":9},{"$f":"SUM(AN8+AN26+AN44+AN62+AN80+AN98)","v":8},{"$f":"SUM(AX8+AX26+AX44+AX62+AX80+AX98)","v":0},34]
[null,"Time",null,null,null,null,null,"8-9.00am","8-9am",null,null,"Time",null,null,null,null,null,"8-9.00am","8-9am",null,null,"Time",null,null,null,null,null,null,"8-9am",null,null,"Time",null,null,null,null,null,"8-9.00am","8-9am",null,null,"Time",null,null,null,null,null,null,null,null,null,"Cost@£8.50",68,76.5,76.5,68,{"$f":"BE8*18.5","v":0},289]
[null,"Junior Hrs ",null,2.5,null,null,3,1,4.5,{"$f":"SUM(C10:I10)","v":11},null,"Junior Hrs ",null,null,null,null,3,1,4.5,{"$f":"SUM(M10:S10)","v":8.5},null,"Junior Hrs ",null,null,null,null,null,null,4.5,{"$f":"SUM(W10:AC10)","v":4.5},null,"Junior Hrs ",null,2.5,null,null,3,1,4.5,{"$f":"SUM(AG10:AM10)","v":11},null,"Junior Hrs ",null,null,null,null,null,null,null,{"$f":"SUM(AQ10:AW10)","v":0},null,"Junior Hrs ",{"$f":"SUM(J10+J28+J46+J64+J82+J100)","v":37.75},{"$f":"SUM(T10+T28+T46+T64+T82+T100)","v":48},48,43.75,{"$f":"SUM(AX10+AX28+AX46+AX64+AX82+AX100)","v":0},177.5]
{"$rows_left_out":100}
{"sheet":"PoolHire(Sep - Mar)","index":9,"n_rows":109,"n_cols":80,"rows_kept":109,"cut":false,"hidden":true,"merged":[]}
["STRETFORD AMATEUR SWIMMING CLUB",null,null,null,null,null,null,null,null,null,"STRETFORD AMATEUR SWIMMING CLUB",null,null,null,null,null,null,null,null,null,"STRETFORD AMATEUR SWIMMING CLUB",null,null,null,null,null,null,null,null,null,"STRETFORD AMATEUR SWIMMING CLUB",null,null,null,null,null,null,null,null,null,"STRETFORD AMATEUR SWIMMING CLUB",null,null,null,null,null,null,null,null,null,"STRETFORD AMATEUR SWIMMING CLUB",null,null,null,null,null,null,null,null,null,"STRETFORD AMATEUR SWIMMING CLUB",null,null,null,null,null,null,null,null,null,"STRETFORD AMATEUR SWIMMING CLUB"]
[null,null,null,null,"POOL HIRE ","2003-09-01",null,null,null,null,null,null,null,null,"POOL HIRE ","2003-10-01",null,null,null,null,null,null,null,null,"POOL HIRE ","2003-11-01",null,null,null,null,null,null,null,null,"POOL HIRE ","2003-12-01",null,null,null,null,null,null,null,null,"POOL HIRE ","2004-01-01",null,null,null,null,null,null,null,null,"POOL HIRE ","2004-02-01",null,null,null,null,null,null,null,null,"POOL HIRE ","2004-03-01",null,null,null,null,null,"September 2002-March 2003",null,null,null,null,null,null,2003]
[]
[{"$f":"$F$2","v":"2003-09-01"},"Date",1,2,3,4,5,6,7,"Total",{"$f":"$P$2","v":"2003-10-01"},"Date",null,null,1,2,3,4,5,"Total",{"$f":"$Z$2","v":"2003-11-01"},"Date",null,null,null,null,null,1,2,"Total",{"$f":"$AJ$2","v":"2003-12-01"},"Date",1,2,3,4,5,6,7,"Total",{"$f":"$AT$2","v":"2004-01-01"},"Date",null,null,null,1,2,3,4,"Total",{"$f":"$BD$2","v":"2004-02-01"},"Date",null,null,null,null,null,null,1,"Total",{"$f":"$BN$2","v":"2004-03-01"},"Date",1,2,3,4,5,6,7,"Total"," ","Year",2002,2002,{"$f":"BU4","v":2002},{"$f":"BU4","v":2002},{"$f":"BU4+1","v":2003},{"$f":"BU4+1","v":2003},{"$f":"BU4+1","v":2003},"Total"]
[null,"Day","Mon","Tue","Wed","Thu","Fri","Sat","Sun","Hours",null,"Day","Mon","Tue","Wed","Thu","Fri","Sat","Sun","Hours",null,"Day","Mon","Tue","Wed","Thu","Fri","Sat","Sun","Hours",null,"Day","Mon","Tue","Wed","Thu","Fri","Sat","Sun","Hours",null,"Day","Mon","Tue","Wed","Thu","Fri","Sat","Sun","Hours",null,"Day","Mon","Tue","Wed","Thu","Fri","Sat","Sun","Hours",null,"Day","Mon","Tue","Wed","Thu","Fri","Sat","Sun","Hours",null,"Month","Sep","Oct","Nov","Dec","Jan","Feb","Mar","Hours"]
["Main Pool","Junior Hrs",null,null,null,null,null,null,null,{"$f":"SUM(C6:I6)","v":0},"Main Pool","Junior Hrs",null,null,null,null,null,null,null,{"$f":"SUM(M6:S6)","v":0},"Main Pool","Junior Hrs",null,null,null,null,null,null,null,{"$f":"SUM(W6:AC6)","v":0},"Main Pool","Junior Hrs",null,null,null,null,null,null,null,{"$f":"SUM(AG6:AM6)","v":0},"Main Pool","Junior Hrs",null,null,null,null,null,null,null,{"$f":"SUM(AQ6:AW6)","v":0},"Main Pool","Junior Hrs",null,null,null,null,null,null,null,{"$f":"SUM(BA6:BG6)","v":0},"Main Pool","Junior Hrs",null,null,null,null,null,null,null,{"$f":"SUM(BK6:BQ6)","v":0},"Main Pool","Junior Hrs",{"$f":"SUM(J6+J24+J42+J60+J78+J96)","v":0},{"$f":"SUM(T6+T24+T42+T60+T78+T96)","v":0},{"$f":"SUM(AD6+AD24+AD42+AD60+AD78+AD96)","v":0},{"$f":"SUM(AN6+AN24+AN42+AN60+AN78+AN96)","v":0},{"$f":"SUM(AX6+AX24+AX42+AX60+AX78+AX96)","v":0},{"$f":"SUM(BH6+BH24+BH42+BH60+BH78+BH96)","v":0},{"$f":"SUM(BR6+BR24+BR42+BR60+BR78+BR96)","v":0},{"$f":"SUM(BU6:CA6)","v":0}]
[null,"Time",null,null,null,null,null,null,null,null,null,"Time",null,null,null,null,null,null,null,null,null,"Time",null,null,null,null,null,null,null,null,null,"Time",null,null,null,null,null,null,null,null,null,"Time",null,null,null,null,null,null,null,null,null,"Time",null,null,null,null,null,null,null,null,null,"Time",null,null,null,null,null,null,null,null,null,"Cost @ £9.25",{"$f":"BU6*9","v":0},{"$f":"BV6*9","v":0},0,0,0,0,0,0]
[null,"Junior Hrs",null,null,null,null,null,1,1,{"$f":"SUM(C8:I8)","v":2},null,"Junior Hrs",null,null,null,null,null,1,1,{"$f":"SUM(M8:S8)","v":2},null,"Junior Hrs",null,null,null,null,null,1,1,{"$f":"SUM(W8:AC8)","v":2},null,"Junior Hrs",null,null,null,null,null,1,1,{"$f":"SUM(AG8:AM8)","v":2},null,"Junior Hrs",null,null,null,null,null,null,1,{"$f":"SUM(AQ8:AW8)","v":1},null,"Junior Hrs",null,null,null,null,null,null,1,{"$f":"SUM(BA8:BG8)","v":1},null,"Junior Hrs",null,null,null,null,null,1,1,{"$f":"SUM(BK8:BQ8)","v":2},null,"Junior Hrs",{"$f":"SUM(J8+J26+J44+J62+J80+J98)","v":8},{"$f":"SUM(T8+T26+T44+T62+T80+T98)","v":8},{"$f":"SUM(AD8+AD26+AD44+AD62+AD80+AD98)","v":10},{"$f":"SUM(AN8+AN26+AN44+AN62+AN80+AN98)","v":5},{"$f":"SUM(AX8+AX26+AX44+AX62+AX80+AX98)","v":8},{"$f":"SUM(BH8+BH26+BH44+BH62+BH80+BH98)","v":9},{"$f":"SUM(BR8+BR26+BR44+BR62+BR80+BR98)","v":8},56]
[null,"Time",null,null,null,null,null,"8-9pm","8-9pm",null,null,"Time",null,null,null,null,null,"8-9am","8-9am",null,null,"Time",null,null,null,null,null,"8-9am","8-9am",null,null,"Time",null,null,null,null,null,"8-9am","8-9am",null,null,"Time",null,null,null,null,null,null,"8-9am",null,null,"Time",null,null,null,null,null,null,"8-9am",null,null,"Time",null,null,null,null,null,"8-9am","8-9am",null,null,"Cost @ £19.00",171,152,152,95,152,152,190,1064]
[null,"Junior Hrs ",null,2.5,null,null,3,1,4.5,{"$f":"SUM(C10:I10)","v":11},null,"Junior Hrs ",null,null,null,null,3,1,2.5,{"$f":"SUM(M10:S10)","v":6.5},null,"Junior Hrs ",null,null,null,null,null,1,4.5,{"$f":"SUM(W10:AC10)","v":5.5},null,"Junior Hrs ",null,2.5,null,null,3,3,4.5,{"$f":"SUM(AG10:AM10)","v":13},null,"Junior Hrs ",null,null,null,null,null,null,4.5,{"$f":"SUM(AQ10:AW10)","v":4.5},null,"Junior Hrs ",null,null,null,null,null,null,4.5,{"$f":"SUM(BA10:BG10)","v":4.5},null,"Junior Hrs ",null,2.5,null,null,3,1,4.5,{"$f":"SUM(BK10:BQ10)","v":11},null,"Junior Hrs ",48.5,46.5,48,29,44,44,48,308]
{"$rows_left_out":99}